Bug 8936 - x86_64 build failed: undefined reference to loaddebug ... error: Bad exit status from /usr/src/tmp/rpm-tmp.13739 (%build) So kernel can't be built.

  bugzilla.altlinux.org

Jul 30, 2018 ... I'm experiencing difficulties working with boost::python and boost::python::numpy, with python 2.7, boost 1.67.0, and Eigen3.3. My compiler is ...

  stackoverflow.com

Решено: Странная ошибка: [Linker error] undefined reference to ` __dyn_tls_init_callback' [Linker error] undefined reference to ld returned 1 ...

  www.cyberforum.ru

... In function `std::thread::thread(void (&)())': /usr/include/c++/7/thread:122: undefined reference to `pthread_create' collect2: error: ld returned 1 ...

  www.linux.org.ru

Sep 14, 2017 ... But when compiling, I get /home/rolandar/local_opt/intel/mkl/lib/intel64/ libmkl_gnu_thread.so: error: undefined reference to 'fopen' ...

  stackoverflow.com

20 авг 2018 ... make -j1 -lpthread. - вместо -lpthread лучше писать -pthread - опцию -pthread нужно передавать не make а gcc.

  toster.ru

25 июл 2018 ... When building the project, I always receive an Undefined reference error referring to one or more functions in cuse.c . For example:

  stackoverflow.com

head.h #pragma once struct beef { void pillow(); };. pillow.cpp #include <iostream > #include "head.h" void beef::pillow() { std::cout << "pillow\n"; }. main.cpp

  ru.stackoverflow.com

Dec 20, 2017 ... Fixed it. I dont know the exact reason how it get fixed. I reverted all the changes I' ve made in Android.mk , Application.mk and OpenCV.mk, Now ...

  stackoverflow.com

6 ноя 2016 ... _ZN5QuoteD2Ev[_ZN5QuoteD5Ev]+0xd): undefined reference to `vtable for ... undefined reference to `typeinfo for Quote' collect2: error: ld ...

  ru.stackoverflow.com

The errors that appear (when I try to compile the source files) are: 1. median.cpp. 1 2. [Linker error] undefined reference to `WinMain@16' ld returned 1 exit

  www.cplusplus.com

Solved error: undefined reference to. This topic has been deleted. Only users with topic management privileges can see it.

  forum.qt.io

Possible Duplicate: What is an undefined reference/unresolved external symbol error and how do I fix it? Trying to compile my program via g++ -o prog1

  stackoverflow.com

I get the error: … when I gcc *.o. I'm not quite sure what causes this error. Other posters have explained it as the function is not found or the function is empty.

  stackoverflow.com

Email codedump link for Undefined reference to error handling functions from &quot;The Linux Programming Interface&quot; Email has been send.

  codedump.io

- The error refers to the line where I call the function payroll() and pass the variables to it. I'm using C-Free Standard for my compiler and the error is this

  cboard.cprogramming.com

Undefined reference to Error. Hello, plz help me out with this error, i am getting this error when i compile my code with gcc.

  www.unix.com

The undefined reference error pops up when I try to compile Bitwise.cpp, which references printBinary.h which uses a function in printBinary.cpp.

  www.daniweb.com

> Using Arduino. > Programming Questions. > Compiling error - undefined reference to 'main'.

  forum.arduino.cc

Put simply, the “undefined reference” error means you have a reference (nothing to do with the C++ reference type) to a name (function, variable, constant etc.) in your program that the linker cannot find a definition for when it looks through all the object files and libraries that make up your project.

  latedev.wordpress.com

Мировые новости: