7 ноя 2017 ... Ошибка означает, что не все виртуальные методы определены, какой-то " чистый" виртуальный метод не определен в вашем классе.

  toster.ru

13 авг 2014 ... Для связи процессора Nios II c остальными компонентами системы-на- кристалле Altera ..... \hello_nios_bsp/HAL/src/alt_main.c:154: undefined reference to `main' ... Error: Led.nios2_qsys_ 0: Reset slave is not specified.

  marsohod.org

... undefined reference to `main' collect2: error: ld returned 1 exit status ... Для начала либо используй g++, либо переименуй файл в .c.

  www.linux.org.ru

Вот так. В проекте должны быть оба файла - и pillow.cpp , и main.cpp . Обратите внимание, как правильно определять структуру в C++.

  ru.stackoverflow.com

test.c:(.text+0xf): undefined reference to `ENGINE_load_openssl' ... reference to ` ENGINE_register_all_pkey_asn1_meths' collect2: error: ld returned 1 exit status .... #include int main() { printf("GOST example start.

  www.pki.gov.kz

  forum.arduino.cc

  www.includehelp.com

  c.devhelping.com

  www.linuxquestions.org

  cboard.cprogramming.com

  qaru.site

  bighow.org

24 авг 2017 ... У вас в .pro -файле допущена опечатка: SOURCES += \ main.cpp \ mainwindow.cpp\ scene.h ^^^^^^^. Замените scene.h на scene.cpp в ...

  ru.stackoverflow.com

I'm working on a simple class List, but when compiling the header and cpp file, I get the error: undefined reference to `main' What am I doing wrong, and how could I fix this?

  stackoverflow.com

27 авг 2017 ... main.c:5:12: warning: implicit declaration of function 'getch' ... to `ungetch' main.c :(.text+0x3f): undefined reference to `getch' collect2: error: ld ...

  toster.ru

25 июл 2018 ... When building the project, I always receive an Undefined reference error referring to one or more functions in cuse.c . ... src/main/cpp/daemon.cpp.o: In function `start_cuse_server()': src/main/cpp/daemon.cpp:65: undefined ...

  stackoverflow.com

  software.intel.com

30 янв 2018 ... libmingw32.a(main.o):(.text.startup+0xa7)||undefined reference to `WinMain@16| ... c:\mingw\bin\..\lib\gcc\mingw32\4.9.3\..\..\. ... Build failed: 1 error(s), 0 warning(s) (0 minute(s), 1 second(s)) ===| I downloaded this code from ...

  forums.codeblocks.org

20 авг 2018 ... CMakeFiles/myprog2.dir/main.cpp.o: In function `std::thread::thread(void (&)())': / usr/include/c++/7/thread:122: undefined reference to ...

  toster.ru

  forum.codenet.ru

Page generated - 0.0335988998 (d27eaca1a485a0ebedbc4021bf0649b9)